DBG Install problem

For programming and general questions on Zend Framework

DBG Install problem

Postby adminloozer on Mon Jan 07, 2013 2:58 pm

Hello,
I'm trying to install the DBG (archive : dbg-2.15.5) under OSX 10.6.8. I need to compile the sources to get the .so
My config is iMAc Mountain Lion 10.6.8 - PHP 5.3.15 - Zend Engine V2.3.0 - 64 bits processors
I've got the following errors :(

dbg-2.11.32/dbg_cmd.c: In function ‘handler_add_eval_reply’:
dbg-2.11.32/dbg_cmd.c:626: error: ‘zend_executor_globals’ has no member named ‘function_state_ptr’
dbg-2.11.32/dbg_cmd.c:629: error: ‘struct _zend_compiler_globals’ has no member named ‘handle_op_arrays’
dbg-2.11.32/dbg_cmd.c:663: error: ‘struct _zend_compiler_globals’ has no member named ‘handle_op_arrays’
dbg-2.11.32/dbg_cmd.c:666: error: ‘zend_executor_globals’ has no member named ‘function_state_ptr’
dbg-2.11.32/dbg_cmd.c: In function ‘dbg_ack_loop’:
dbg-2.11.32/dbg_cmd.c:827: error: too few arguments to function ‘zend_set_timeout’
dbg-2.11.32/dbg_cmd.c: In function ‘dbg_send_command’:
dbg-2.11.32/dbg_cmd.c:854: error: too few arguments to function ‘zend_set_timeout’
make: *** [dbg_cmd.lo] Error 1




It seems I use the wrong zend engine ? If it is correct how can I correct this (change the zend engine...). If not any help welcome
Thank.
adminloozer
 
Posts: 1
Joined: Mon Jan 07, 2013 2:48 pm

Return to Zend Framework

Who is online

Users browsing this forum: Yahoo [Bot] and 12 guests